BDBM51338 MLS000680413::N-[3-(1-mesyl-5-phenyl-2-pyrazolin-3-yl)phenyl]methanesulfonamide::N-[3-(2-methylsulfonyl-3-phenyl-3,4-dihydropyrazol-5-yl)phenyl]methanesulfonamide::SMR000324553::cid_4248778
SMILES CS(=O)(=O)Nc1cccc(c1)C1=NN(C(C1)c1ccccc1)S(C)(=O)=O
InChI Key InChIKey=SGUZUMWSJWYABV-UHFFFAOYSA-N
Data  1 IC50
  Tab Delimited (TSV)   2D SDfile   Computed 3D by Vconf -m prep SDfile
Find this compound or compounds like it in BindingDB:
Activity Spreadsheet -- Enzyme Inhibition Constant Data from BindingDB
Found 1 hit for monomerid = 51338
TargetDNA repair protein RAD51 homolog 1(Homo sapiens (Human))
Pcmd
Curated by PubChem BioAssay
LigandPNGBDBM51338(MLS000680413 | N-[3-(1-mesyl-5-phenyl-2-pyrazolin-...)
Affinity DataIC50:  5.30E+4nM. Assay description: Project Title: A screen for modulators of human Rad51, a key DNA repair protein Application Number: MH084119 Assay Submitter: Dr. Alex Mazin Submitte...
In DepthDetails PCBioAssay