BDBM51958 2,2-Dimethyl-N-(5-{[(thiophen-2-ylmethyl)-carbamoyl]-methylsulfanyl}-[1,3,4]thiadiazol-2-yl)-propionamide::2,2-dimethyl-N-[5-[2-oxidanylidene-2-(thiophen-2-ylmethylamino)ethyl]sulfanyl-1,3,4-thiadiazol-2-yl]propanamide::2,2-dimethyl-N-[5-[2-oxo-2-(thiophen-2-ylmethylamino)ethyl]sulfanyl-1,3,4-thiadiazol-2-yl]propanamide::2,2-dimethyl-N-[5-[[2-oxo-2-(thiophen-2-ylmethylamino)ethyl]thio]-1,3,4-thiadiazol-2-yl]propanamide::MLS000529634::N-[5-[[2-keto-2-(2-thenylamino)ethyl]thio]-1,3,4-thiadiazol-2-yl]-2,2-dimethyl-propionamide::SMR000122109::cid_3220530
SMILES CC(C)(C)C(=O)Nc1nnc(SCC(=O)NCc2cccs2)s1
InChI Key InChIKey=NBHLHJMBUCVCDH-UHFFFAOYSA-N
Data  4 IC50
  Tab Delimited (TSV)   2D SDfile   Computed 3D by Vconf -m prep SDfile
Find this compound or compounds like it in BindingDB:
Activity Spreadsheet -- Enzyme Inhibition Constant Data from BindingDB
Found 4 hits for monomerid = 51958
TargetBeta-lactamase(Pseudomonas aeruginosa)
The Scripps Research Institute Molecular Screening Center
Curated by PubChem BioAssay
LigandPNGBDBM51958(2,2-Dimethyl-N-(5-{[(thiophen-2-ylmethyl)-carbamoy...)
Affinity DataIC50:  2.62E+3nM. Assay description: Source (MLPCN Center Name): The Scripps Research Institute Molecular Screening Center (SRIMSC) Center Affiliation: The Scripps Research Institute (TS...
In DepthDetails PCBioAssay
TargetBeta-lactamase(Pseudomonas aeruginosa)
The Scripps Research Institute Molecular Screening Center
Curated by PubChem BioAssay
LigandPNGBDBM51958(2,2-Dimethyl-N-(5-{[(thiophen-2-ylmethyl)-carbamoy...)
Affinity DataIC50:  5.96E+4nM. Assay description: Source (MLPCN Center Name): The Scripps Research Institute Molecular Screening Center (SRIMSC) Center Affiliation: The Scripps Research Institute (TS...
In DepthDetails PCBioAssay
TargetBeta-lactamase(Pseudomonas aeruginosa)
The Scripps Research Institute Molecular Screening Center
Curated by PubChem BioAssay
LigandPNGBDBM51958(2,2-Dimethyl-N-(5-{[(thiophen-2-ylmethyl)-carbamoy...)
Affinity DataIC50:  874nM. Assay description: Source (MLPCN Center Name): The Scripps Research Institute Molecular Screening Center (SRIMSC) Center Affiliation: The Scripps Research Institute (TS...
In DepthDetails PCBioAssay
TargetBeta-lactamase(Pseudomonas aeruginosa)
The Scripps Research Institute Molecular Screening Center
Curated by PubChem BioAssay
LigandPNGBDBM51958(2,2-Dimethyl-N-(5-{[(thiophen-2-ylmethyl)-carbamoy...)
Affinity DataIC50:  5.96E+4nM. Assay description: Source (MLPCN Center Name): The Scripps Research Institute Molecular Screening Center (SRIMSC) Center Affiliation: The Scripps Research Institute (TS...
In DepthDetails PCBioAssay