BDBM519743 US11142525, Example 144
SMILES CCC(CC)n1cnnc1-c1cccc(n1)N1Cc2c(cc(nc2CNC)N2CCC[C@H]2C)C1=O
InChI Key InChIKey=YNVHDGJLBBAPJJ-QGZVFWFLSA-N
Data  1 KI
  Tab Delimited (TSV)   2D SDfile   Computed 3D by Vconf -m prep SDfile
Find this compound or compounds like it in BindingDB:
Activity Spreadsheet -- Enzyme Inhibition Constant Data from BindingDB
Found 1 hit for monomerid = 519743
TargetMitogen-activated protein kinase kinase kinase kinase 1(Homo sapiens (Human))
Pfizer
US Patent
LigandPNGBDBM519743(US11142525, Example 144)
Affinity DataKi: <0.0500nM. Assay description: HPK1 enzyme inhibition was measured using a microfluidic mobility shift assay (MSA). The reactions were conducted in 50 μL volumes in 96-well pl...
Ligand InfoPC cidPC sid
In DepthDetails US Patent