BDBM52491 MLS000574946::SMR000156317::cid_97662
SMILES COc1cc2C(=O)c3nccc4cc(OC)c(OC)c(-c2cc1OC)c34
InChI Key InChIKey=ZYKCETVKVRJFGD-UHFFFAOYSA-N
Data  2 IC50  2 EC50
  Tab Delimited (TSV)   2D SDfile   Computed 3D by Vconf -m prep SDfile
Find this compound or compounds like it in BindingDB:
Activity Spreadsheet -- Enzyme Inhibition Constant Data from BindingDB
Found 4 hits for monomerid = 52491
TargetPOsterior Segregation(Caenorhabditis elegans)
Broad Institute
Curated by PubChem BioAssay
LigandPNGBDBM52491(MLS000574946 | SMR000156317 | cid_97662)
Affinity DataEC50:  6.86E+4nM. Assay description: Broad Institute: MLPCN maternal gene expression Project ID: 2024 Keywords: Zinc finger, C. elegans, maternal gene expression, RNA-protein interac...
In DepthDetails PCBioAssay
TargetAmine oxidase [flavin-containing] B(Homo sapiens (Human))
Sunchon National University
Curated by ChEMBL
LigandPNGBDBM52491(MLS000574946 | SMR000156317 | cid_97662)
Affinity DataIC50: >2.00E+4nM. Assay description: Inhibition of recombinant human MAO-B using benzylamine as substrate incubated for 30 mins by spectrophotometric method
In DepthDetails ArticlePubMed
TargetAmine oxidase [flavin-containing] A(Homo sapiens (Human))
Sunchon National University
Curated by ChEMBL
LigandPNGBDBM52491(MLS000574946 | SMR000156317 | cid_97662)
Affinity DataIC50: >2.00E+4nM. Assay description: Inhibition of recombinant human MAO-A using kynuramine as substrate incubated for 20 mins by spectrophotometric method
In DepthDetails ArticlePubMed
TargetZinc finger protein mex-5(Caenorhabditis elegans)
Broad Institute
Curated by PubChem BioAssay
LigandPNGBDBM52491(MLS000574946 | SMR000156317 | cid_97662)
Affinity DataEC50:  834nM. Assay description: Broad Institute: MLPCN maternal gene expression Project ID: 2024 Keywords: Zinc finger, C. elegans, maternal gene expression, RNA-protein interac...
In DepthDetails PCBioAssay