BDBM52494 4-bromanyl-N-(2-methoxyphenazin-1-yl)benzamide::4-bromo-N-(2-methoxy-1-phenazinyl)benzamide::4-bromo-N-(2-methoxyphenazin-1-yl)benzamide::MLS000418434::SMR000264964::cid_4127051
SMILES COc1ccc2nc3ccccc3nc2c1NC(=O)c1ccc(Br)cc1
InChI Key InChIKey=LHEJISHZTQUAOA-UHFFFAOYSA-N
Data  2 IC50  2 EC50
  Tab Delimited (TSV)   2D SDfile   Computed 3D by Vconf -m prep SDfile
Find this compound or compounds like it in BindingDB:
Activity Spreadsheet -- Enzyme Inhibition Constant Data from BindingDB
Found 4 hits for monomerid = 52494
TargetPOsterior Segregation(Caenorhabditis elegans)
Broad Institute
Curated by PubChem BioAssay
LigandPNGBDBM52494(4-bromanyl-N-(2-methoxyphenazin-1-yl)benzamide | 4...)
Affinity DataEC50:  6.41E+3nM. Assay description: Broad Institute: MLPCN maternal gene expression Project ID: 2024 Keywords: Zinc finger, C. elegans, maternal gene expression, RNA-protein interac...
In DepthDetails PCBioAssay
TargetSentrin-specific protease 1(Homo sapiens (Human))
Burnham Center For Chemical Genomics
Curated by PubChem BioAssay
LigandPNGBDBM52494(4-bromanyl-N-(2-methoxyphenazin-1-yl)benzamide | 4...)
Affinity DataIC50:  1.00E+4nM
In DepthDetails PCBioAssay
TargetSentrin-specific protease 1(Homo sapiens (Human))
Burnham Center For Chemical Genomics
Curated by PubChem BioAssay
LigandPNGBDBM52494(4-bromanyl-N-(2-methoxyphenazin-1-yl)benzamide | 4...)
Affinity DataIC50:  9.47E+3nM
In DepthDetails PCBioAssay
TargetZinc finger protein mex-5(Caenorhabditis elegans)
Broad Institute
Curated by PubChem BioAssay
LigandPNGBDBM52494(4-bromanyl-N-(2-methoxyphenazin-1-yl)benzamide | 4...)
Affinity DataEC50:  6.66E+3nM. Assay description: Broad Institute: MLPCN maternal gene expression Project ID: 2024 Keywords: Zinc finger, C. elegans, maternal gene expression, RNA-protein interac...
In DepthDetails PCBioAssay