BDBM52495 4-[2,5-dimethyl-3-[1-oxo-2-[1-oxo-2-(3-oxo-4H-1,4-benzothiazin-2-yl)ethoxy]ethyl]-1-pyrrolyl]benzoic acid methyl ester::4-[3-[2-[2-(3-keto-4H-1,4-benzothiazin-2-yl)acetyl]oxyacetyl]-2,5-dimethyl-pyrrol-1-yl]benzoic acid methyl ester::MLS000335579::SMR000253333::cid_4223397::methyl 4-[2,5-dimethyl-3-[2-[2-(3-oxidanylidene-4H-1,4-benzothiazin-2-yl)ethanoyloxy]ethanoyl]pyrrol-1-yl]benzoate::methyl 4-[2,5-dimethyl-3-[2-[2-(3-oxo-4H-1,4-benzothiazin-2-yl)acetyl]oxyacetyl]pyrrol-1-yl]benzoate
SMILES COC(=O)c1ccc(cc1)-n1c(C)cc(C(=O)COC(=O)CC2Sc3ccccc3NC2=O)c1C
InChI Key InChIKey=DSRPMKKQDHXERE-UHFFFAOYSA-N
Data  2 EC50
  Tab Delimited (TSV)   2D SDfile   Computed 3D by Vconf -m prep SDfile
Find this compound or compounds like it in BindingDB:
Activity Spreadsheet -- Enzyme Inhibition Constant Data from BindingDB
Found 2 hits for monomerid = 52495
TargetZinc finger protein mex-5(Caenorhabditis elegans)
Broad Institute
Curated by PubChem BioAssay
LigandPNGBDBM52495(4-[2,5-dimethyl-3-[1-oxo-2-[1-oxo-2-(3-oxo-4H-1,4-...)
Affinity DataEC50:  3.00E+5nM. Assay description: Broad Institute: MLPCN maternal gene expression Project ID: 2024 Keywords: Zinc finger, C. elegans, maternal gene expression, RNA-protein interac...
In DepthDetails PCBioAssay
TargetPOsterior Segregation(Caenorhabditis elegans)
Broad Institute
Curated by PubChem BioAssay
LigandPNGBDBM52495(4-[2,5-dimethyl-3-[1-oxo-2-[1-oxo-2-(3-oxo-4H-1,4-...)
Affinity DataEC50:  3.00E+5nM. Assay description: Broad Institute: MLPCN maternal gene expression Project ID: 2024 Keywords: Zinc finger, C. elegans, maternal gene expression, RNA-protein interac...
In DepthDetails PCBioAssay