BDBM525167 Benzyl N-[(1S)-1-[[(3-amino-3-oxo-propyl)-(2-chloro-2-fluoro-acetyl)amino]carbamoyl]-3-methyl-butyl]carbamate::WO2022043374, Example 17-A
SMILES CC(C)C[C@H](NC(=O)OCc1ccccc1)C(=O)NN(CCC(N)=O)C(=O)[C@@H](F)Cl
InChI Key InChIKey=FISXMHRNSNKTTF-GOEBONIOSA-N
Data  1 IC50
  Tab Delimited (TSV)   2D SDfile   Computed 3D by Vconf -m prep SDfile
Find this compound or compounds like it in BindingDB:
Activity Spreadsheet -- Enzyme Inhibition Constant Data from BindingDB
Found 1 hit for monomerid = 525167
TargetReplicase polyprotein 1ab(2019-nCoV)
F. Hoffmann-La Roche
WIPO
LigandPNGBDBM525167(Benzyl N-[(1S)-1-[[(3-amino-3-oxo-propyl)-(2-chlor...)
Affinity DataIC50:  1.63E+3nM. Assay description: For the SARS-CoV-2 3CLpro assay, 2 μL of 0.02 μM recombinant SARS-CoV-2 3CL protease were mixed with serial dilutions of each c...
Ligand InfoPC cidPC sid
In DepthDetails PubMed