BDBM525187 N-[(1S)-1-[[(2-fluoroacetyl)-[(2-oxo-pyrrolidin-3-yl)methyl]amino]carbamoyl]-3-methyl-butyl]-1H-indole-2-carboxamide::WO2022043374, Example 38-A
SMILES FCC(=O)N(C[C@H]1CCNC1=O)NC(=O)[C@H](CC1CCCCC1)NC(=O)c1cc2ccccc2[nH]1
InChI Key InChIKey=WSIPPAAQIYBPKD-QUCCMNQESA-N
Data  1 IC50
  Tab Delimited (TSV)   2D SDfile   Computed 3D by Vconf -m prep SDfile
Find this compound or compounds like it in BindingDB:
Activity Spreadsheet -- Enzyme Inhibition Constant Data from BindingDB
Found 1 hit for monomerid = 525187
TargetReplicase polyprotein 1ab(2019-nCoV)
F. Hoffmann-La Roche
WIPO
LigandPNGBDBM525187(N-[(1S)-1-[[(2-fluoroacetyl)-[(2-oxo-pyrrolidin-3-...)
Affinity DataIC50:  74nM. Assay description: For the SARS-CoV-2 3CLpro assay, 2 μL of 0.02 μM recombinant SARS-CoV-2 3CL protease were mixed with serial dilutions of each c...
Ligand InfoPC cidPC sid
In DepthDetails PubMed