BDBM525189 N-[(1S)-2-[2-(3-Amino-3-oxo-propyl)-2-(2-chloroacetyl)hydrazino]-1-(cyclohexylmethyl)-2-oxo-ethyl]-N-methyl-1H-indole-2-carboxamide::WO2022043374, Example 39
SMILES CN([C@@H](CC1CCCCC1)C(=O)NN(CCC(N)=O)C(=O)CCl)C(=O)c1cc2ccccc2[nH]1
InChI Key InChIKey=DAIUROKRWGFBSF-FQEVSTJZSA-N
Data  1 IC50
  Tab Delimited (TSV)   2D SDfile   Computed 3D by Vconf -m prep SDfile
Find this compound or compounds like it in BindingDB:
Activity Spreadsheet -- Enzyme Inhibition Constant Data from BindingDB
Found 1 hit for monomerid = 525189
TargetReplicase polyprotein 1ab(2019-nCoV)
F. Hoffmann-La Roche
WIPO
LigandPNGBDBM525189(N-[(1S)-2-[2-(3-Amino-3-oxo-propyl)-2-(2-chloroace...)
Affinity DataIC50:  2nM. Assay description: For the SARS-CoV-2 3CLpro assay, 2 μL of 0.02 μM recombinant SARS-CoV-2 3CL protease were mixed with serial dilutions of each c...
Ligand InfoPC cidPC sid
In DepthDetails PubMed