BDBM525212 WO2022043374, Example 57-A
SMILES CC(C)C[C@H](NC(=O)c1cc2cc(F)ccc2[nH]1)C(=O)NN(CCC(N)=O)C(=O)[C@@H](F)Cl
InChI Key InChIKey=REVIPKPNHANBOI-WMLDXEAASA-N
Data  1 IC50
  Tab Delimited (TSV)   2D SDfile   Computed 3D by Vconf -m prep SDfile
Find this compound or compounds like it in BindingDB:
Activity Spreadsheet -- Enzyme Inhibition Constant Data from BindingDB
Found 1 hit for monomerid = 525212
TargetReplicase polyprotein 1ab(2019-nCoV)
F. Hoffmann-La Roche
WIPO
LigandPNGBDBM525212(WO2022043374, Example 57-A)
Affinity DataIC50:  67nM. Assay description: For the SARS-CoV-2 3CLpro assay, 2 μL of 0.02 μM recombinant SARS-CoV-2 3CL protease were mixed with serial dilutions of each c...
Ligand InfoPC cidPC sid
In DepthDetails PubMed