BDBM530309 WO2022064009, Compound 70
SMILES C[C@@H]1Cc2cnc(NCc3ccccc3)nc2CN1C(=O)[C@H]1CCN(C)C[C@@H]1c1ccccc1
InChI Key InChIKey=OHPIHQNDZSUYLV-DCEDVJGZSA-N
Data  2 IC50
  Tab Delimited (TSV)   2D SDfile   Computed 3D by Vconf -m prep SDfile
Find this compound or compounds like it in BindingDB:
Activity Spreadsheet -- Enzyme Inhibition Constant Data from BindingDB
Found 2 hits for monomerid = 530309
TargetCDK-activating kinase assembly factor MAT1/Cyclin-H/Cyclin-dependent kinase 7(Homo sapiens (Human))
Janssen Pharmaceutica
WIPO
LigandPNGBDBM530309(WO2022064009, Compound 70)
Affinity DataIC50:  1.78nM. Assay description: Inhibition potencies of compounds were studied using an absorbance kinetic assay as described below. Absorbance kinetic assay (5 nM CDK7/Cyclin H/MAT...
Ligand InfoPC cidPC sid
In DepthDetails PubMed
TargetCDK-activating kinase assembly factor MAT1/Cyclin-H/Cyclin-dependent kinase 7(Homo sapiens (Human))
Janssen Pharmaceutica
WIPO
LigandPNGBDBM530309(WO2022064009, Compound 70)
Affinity DataIC50: <9.77nM. Assay description: Inhibition potencies of compounds were studied using an absorbance kinetic assay as described below. Compounds with potencies approaching the limit o...
Ligand InfoPC cidPC sid
In DepthDetails PubMed