BDBM530408 WO2022064009, Compound 195b
SMILES C[C@@H]1Cc2cnc(NC3CCOCC3)nc2[C@H](C)N1C(=O)[C@H]1CCN(C)C[C@@H]1c1ccccc1
InChI Key InChIKey=BZHLKNWXJVAFNQ-RJADORODSA-N
Data  2 IC50
  Tab Delimited (TSV)   2D SDfile   Computed 3D by Vconf -m prep SDfile
Find this compound or compounds like it in BindingDB:
Activity Spreadsheet -- Enzyme Inhibition Constant Data from BindingDB
Found 2 hits for monomerid = 530408
TargetCDK-activating kinase assembly factor MAT1/Cyclin-H/Cyclin-dependent kinase 7(Homo sapiens (Human))
Janssen Pharmaceutica
WIPO
LigandPNGBDBM530408(WO2022064009, Compound 195b)
Affinity DataIC50:  4.90nM. Assay description: Inhibition potencies of compounds were studied using an absorbance kinetic assay as described below. Absorbance kinetic assay (5 nM CDK7/Cyclin H/MAT...
Ligand InfoPC cidPC sid
In DepthDetails PubMed
TargetCDK-activating kinase assembly factor MAT1/Cyclin-H/Cyclin-dependent kinase 7(Homo sapiens (Human))
Janssen Pharmaceutica
WIPO
LigandPNGBDBM530408(WO2022064009, Compound 195b)
Affinity DataIC50: <9.77nM. Assay description: Inhibition potencies of compounds were studied using an absorbance kinetic assay as described below. Compounds with potencies approaching the limit o...
Ligand InfoPC cidPC sid
In DepthDetails PubMed