BDBM530495 WO2022076764, Example 24
SMILES COc1ccc(cc1)-n1cc(nc1NC(=O)c1ccc(OC(F)F)cc1)-c1nccs1
InChI Key InChIKey=QCOSHIWZOLJPQK-UHFFFAOYSA-N
Data  2 EC50
  Tab Delimited (TSV)   2D SDfile   Computed 3D by Vconf -m prep SDfile
Find this compound or compounds like it in BindingDB:
Activity Spreadsheet -- Enzyme Inhibition Constant Data from BindingDB
Found 2 hits for monomerid = 530495
TargetN-formyl peptide receptor 2(Homo sapiens (Human))
Bristol-Myers Squibb
WIPO
LigandPNGBDBM530495(WO2022076764, Example 24)
Affinity DataEC50:  110nM
Ligand InfoPC cidPC sid
In DepthDetails PubMed
TargetfMet-Leu-Phe receptor(Homo sapiens (Human))
Bristol-Myers Squibb
WIPO
LigandPNGBDBM530495(WO2022076764, Example 24)
Affinity DataEC50:  9nM
Ligand InfoPC cidPC sid
In DepthDetails PubMed