BDBM530528 WO2022076764, Example 57
SMILES COc1cc(F)c(c(F)c1)-n1cc(nc1NC(=O)c1ccc(OC(F)F)cc1)C(=O)N1CC[C@H](O)C1
InChI Key InChIKey=OPRLGNIBYWUIPV-ZDUSSCGKSA-N
Data  2 EC50
  Tab Delimited (TSV)   2D SDfile   Computed 3D by Vconf -m prep SDfile
Find this compound or compounds like it in BindingDB:
Activity Spreadsheet -- Enzyme Inhibition Constant Data from BindingDB
Found 2 hits for monomerid = 530528
TargetN-formyl peptide receptor 2(Homo sapiens (Human))
Bristol-Myers Squibb
WIPO
LigandPNGBDBM530528(WO2022076764, Example 57)
Affinity DataEC50:  1.90E+3nM
Ligand InfoPC cidPC sid
In DepthDetails PubMed
TargetfMet-Leu-Phe receptor(Homo sapiens (Human))
Bristol-Myers Squibb
WIPO
LigandPNGBDBM530528(WO2022076764, Example 57)
Affinity DataEC50:  120nM
Ligand InfoPC cidPC sid
In DepthDetails PubMed