BDBM530553 N-(l-(2,6-Difluoro-4-methoxyphenyl)-4-(3-((2,2,2-trifluoroethyl)amino)cyclobutyl)-1H-imidazol-2-yl)-4-(difluoromethoxy)benzamide::WO2022076764, Example 82
SMILES COc1cc(F)c(c(F)c1)-n1cc(CC2CC(C2)NCC(F)(F)F)nc1NC(=O)c1ccc(OC(F)F)cc1
InChI Key InChIKey=FAPKSURICPIOPR-UHFFFAOYSA-N
Data  2 EC50
  Tab Delimited (TSV)   2D SDfile   Computed 3D by Vconf -m prep SDfile
Find this compound or compounds like it in BindingDB:
Activity Spreadsheet -- Enzyme Inhibition Constant Data from BindingDB
Found 2 hits for monomerid = 530553
TargetN-formyl peptide receptor 2(Homo sapiens (Human))
Bristol-Myers Squibb
WIPO
LigandPNGBDBM530553(N-(l-(2,6-Difluoro-4-methoxyphenyl)-4-(3-((2,2,2-t...)
Affinity DataEC50:  85nM
Ligand InfoPC cidPC sid
In DepthDetails PubMed
TargetfMet-Leu-Phe receptor(Homo sapiens (Human))
Bristol-Myers Squibb
WIPO
LigandPNGBDBM530553(N-(l-(2,6-Difluoro-4-methoxyphenyl)-4-(3-((2,2,2-t...)
Affinity DataEC50:  10nM
Ligand InfoPC cidPC sid
In DepthDetails PubMed