BDBM530555 (R)-1,3-bis(4-fluorophenyl)-N-(3-methyl-l,1-dioxidotetrahydrothiophen-3-yl)-2-oxo-2,3-dihydro-1H-benzo[d]imidazole-5-carboxamide::WO2022076495, EXAMPLE 1
SMILES C[C@]1(CCS(=O)(=O)C1)NC(=O)c1ccc2n(-c3ccc(F)cc3)c(=O)n(-c3ccc(F)cc3)c2c1
InChI Key InChIKey=XNOZXMKVOLFOBL-RUZDIDTESA-N
Data  1 IC50
  Tab Delimited (TSV)   2D SDfile   Computed 3D by Vconf -m prep SDfile
Find this compound or compounds like it in BindingDB:
Activity Spreadsheet -- Enzyme Inhibition Constant Data from BindingDB
Found 1 hit for monomerid = 530555
TargetDiacylglycerol O-acyltransferase 2(Homo sapiens (Human))
Merck Sharp &Amp
WIPO
LigandPNGBDBM530555((R)-1,3-bis(4-fluorophenyl)-N-(3-methyl-l,1-dioxid...)
Affinity DataIC50:  573nM. Assay description: DGAT2 activity was determined by measuring the amount of enzymatic product 13Ci8-triolein (13C-l,2,3-Tri(cis-9-octadecenoyl)glycerol) using the membr...
Ligand InfoPC cidPC sid
In DepthDetails PubMed