BDBM530559 WO2022076495, EXAMPLE 5::l-(2-(Difluoromethoxy)-5-fluoropyridin-4-yl)-3-isopropyl-N-(4-methyl-l,1-dioxidotetrahydro-2H-thiopyran-4-yl)-2-oxo-2,3-dihydro-1H-benzo[d]imidazole-5-carboxamide
SMILES CC(C)n1c2cc(ccc2n(-c2cc(OC(F)F)ncc2F)c1=O)C(=O)NC1(C)CCS(=O)(=O)CC1
InChI Key InChIKey=WQZUWPLALYKPIX-UHFFFAOYSA-N
Data  1 IC50
  Tab Delimited (TSV)   2D SDfile   Computed 3D by Vconf -m prep SDfile
Find this compound or compounds like it in BindingDB:
Activity Spreadsheet -- Enzyme Inhibition Constant Data from BindingDB
Found 1 hit for monomerid = 530559
TargetDiacylglycerol O-acyltransferase 2(Homo sapiens (Human))
Merck Sharp &Amp
WIPO
LigandPNGBDBM530559(WO2022076495, EXAMPLE 5 | l-(2-(Difluoromethoxy)-5...)
Affinity DataIC50:  34nM. Assay description: DGAT2 activity was determined by measuring the amount of enzymatic product 13Ci8-triolein (13C-l,2,3-Tri(cis-9-octadecenoyl)glycerol) using the membr...
Ligand InfoPC cidPC sid
In DepthDetails PubMed