BDBM530589 WO2022076495, EXAMPLE 35
SMILES CC(C)n1c2cc(C(=O)N[C@H]3CCCC[C@@H]3O)c(F)cc2n(-c2cccc(OC(F)F)c2)c1=O
InChI Key InChIKey=JHHULFDVEUCFFF-RXVVDRJESA-N
Data  1 IC50
  Tab Delimited (TSV)   2D SDfile   Computed 3D by Vconf -m prep SDfile
Find this compound or compounds like it in BindingDB:
Activity Spreadsheet -- Enzyme Inhibition Constant Data from BindingDB
Found 1 hit for monomerid = 530589
TargetDiacylglycerol O-acyltransferase 2(Homo sapiens (Human))
Merck Sharp &Amp
WIPO
LigandPNGBDBM530589(WO2022076495, EXAMPLE 35)
Affinity DataIC50:  71nM. Assay description: DGAT2 activity was determined by measuring the amount of enzymatic product 13Ci8-triolein (13C-l,2,3-Tri(cis-9-octadecenoyl)glycerol) using the membr...
Ligand InfoPC cidPC sid
In DepthDetails PubMed