BDBM530620 1-(3-(difluoromethoxy)phenyl)-3-(2-hydroxy-2-methylpropyl)-A-(3-methyl-l,l-dioxidothietan-3-yl)-2-oxo-2,3-dihydro-1H-benzo[d]imidazole-5-carboxamide::WO2022076495, EXAMPLE 64
SMILES CC(C)(O)Cn1c2cc(ccc2n(-c2cccc(OC(F)F)c2)c1=O)C(=O)NC1(C)CS(=O)(=O)C1
InChI Key InChIKey=BHRVQQBSVVPZGS-UHFFFAOYSA-N
Data  1 IC50
  Tab Delimited (TSV)   2D SDfile   Computed 3D by Vconf -m prep SDfile
Find this compound or compounds like it in BindingDB:
Activity Spreadsheet -- Enzyme Inhibition Constant Data from BindingDB
Found 1 hit for monomerid = 530620
TargetDiacylglycerol O-acyltransferase 2(Homo sapiens (Human))
Merck Sharp &Amp
WIPO
LigandPNGBDBM530620(1-(3-(difluoromethoxy)phenyl)-3-(2-hydroxy-2-methy...)
Affinity DataIC50:  37nM. Assay description: DGAT2 activity was determined by measuring the amount of enzymatic product 13Ci8-triolein (13C-l,2,3-Tri(cis-9-octadecenoyl)glycerol) using the membr...
Ligand InfoPC cidPC sid
In DepthDetails PubMed