BDBM530638 WO2022076495, EXAMPLE 74a
SMILES C[C@H](n1c2cc(C(=O)NC3(C)CCS(=O)(=O)CC3)c(F)cc2n(-c2cc(OCC(F)F)ncc2F)c1=O)C(C)(C)O
InChI Key InChIKey=HKIQQNULULCVNT-AWEZNQCLSA-N
Data  1 IC50
  Tab Delimited (TSV)   2D SDfile   Computed 3D by Vconf -m prep SDfile
Find this compound or compounds like it in BindingDB:
Activity Spreadsheet -- Enzyme Inhibition Constant Data from BindingDB
Found 1 hit for monomerid = 530638
TargetDiacylglycerol O-acyltransferase 2(Homo sapiens (Human))
Merck Sharp &Amp
WIPO
LigandPNGBDBM530638(WO2022076495, EXAMPLE 74a)
Affinity DataIC50:  6.10nM. Assay description: DGAT2 activity was determined by measuring the amount of enzymatic product 13Ci8-triolein (13C-l,2,3-Tri(cis-9-octadecenoyl)glycerol) using the membr...
Ligand InfoPC cidPC sid
In DepthDetails PubMed