BDBM530672 WO2022076495, EXAMPLE 103
SMILES CC(C)n1c2cc(cnc2n(-c2cc(OC(F)F)ccc2F)c1=O)C(=O)NC1(C)CCS(=O)(=O)CC1
InChI Key InChIKey=JXVMTCZOKQUZJB-UHFFFAOYSA-N
Data  1 IC50
  Tab Delimited (TSV)   2D SDfile   Computed 3D by Vconf -m prep SDfile
Find this compound or compounds like it in BindingDB:
Activity Spreadsheet -- Enzyme Inhibition Constant Data from BindingDB
Found 1 hit for monomerid = 530672
TargetDiacylglycerol O-acyltransferase 2(Homo sapiens (Human))
Merck Sharp &Amp
WIPO
LigandPNGBDBM530672(WO2022076495, EXAMPLE 103)
Affinity DataIC50:  74nM. Assay description: DGAT2 activity was determined by measuring the amount of enzymatic product 13Ci8-triolein (13C-l,2,3-Tri(cis-9-octadecenoyl)glycerol) using the membr...
Ligand InfoPC cidPC sid
In DepthDetails PubMed