BDBM530681 1-(3-(Difluoromethoxy)phenyl)-6-fluoro-3-isopropyl-N-(4-methyl-1,1-dioxidotetrahydro-2H-thiopyran-4-yl)-2-oxo-2,3-dihydro-1H-benzo[d]imidazole-5-carboxamide::WO2022076495, EXAMPLE 112
SMILES CC(C)n1c2cc(C(=O)NC3(C)CCS(=O)(=O)CC3)c(F)cc2n(-c2cccc(OC(F)F)c2)c1=O
InChI Key InChIKey=WRFRUIFBFPIRMY-UHFFFAOYSA-N
Data  1 IC50
  Tab Delimited (TSV)   2D SDfile   Computed 3D by Vconf -m prep SDfile
Find this compound or compounds like it in BindingDB:
Activity Spreadsheet -- Enzyme Inhibition Constant Data from BindingDB
Found 1 hit for monomerid = 530681
TargetDiacylglycerol O-acyltransferase 2(Homo sapiens (Human))
Merck Sharp &Amp
WIPO
LigandPNGBDBM530681(1-(3-(Difluoromethoxy)phenyl)-6-fluoro-3-isopropyl...)
Affinity DataIC50:  74nM. Assay description: DGAT2 activity was determined by measuring the amount of enzymatic product 13Ci8-triolein (13C-l,2,3-Tri(cis-9-octadecenoyl)glycerol) using the membr...
Ligand InfoPC cidPC sid
In DepthDetails PubMed