BDBM530707 WO2022076496, Example 7a
SMILES CC1(CS(=O)(=O)C1)NC(=O)c1ccc2N(C(=O)[C@](O)(c2c1)C(F)(F)F)c1cccc(OC(F)F)c1
InChI Key InChIKey=RBOXXELIJVZKAN-HXUWFJFHSA-N
Data  1 IC50
  Tab Delimited (TSV)   2D SDfile   Computed 3D by Vconf -m prep SDfile
Find this compound or compounds like it in BindingDB:
Activity Spreadsheet -- Enzyme Inhibition Constant Data from BindingDB
Found 1 hit for monomerid = 530707
TargetDiacylglycerol O-acyltransferase 2(Homo sapiens (Human))
Merck Sharp &Amp
WIPO
LigandPNGBDBM530707(WO2022076496, Example 7a)
Affinity DataIC50:  484nM
Ligand InfoPC cidPC sid
In DepthDetails PubMed