BDBM530737 WO2022076496, Example 34
SMILES CC1(CS(=O)(=O)C1)NC(=O)c1ccc2N(C(=O)C(C)(C)c2c1)c1ccnc(N2CC(F)(F)C2)c1F
InChI Key InChIKey=IKGPHZNPTYZPNV-UHFFFAOYSA-N
Data  1 IC50
  Tab Delimited (TSV)   2D SDfile   Computed 3D by Vconf -m prep SDfile
Find this compound or compounds like it in BindingDB:
Activity Spreadsheet -- Enzyme Inhibition Constant Data from BindingDB
Found 1 hit for monomerid = 530737
TargetDiacylglycerol O-acyltransferase 2(Homo sapiens (Human))
Merck Sharp &Amp
WIPO
LigandPNGBDBM530737(WO2022076496, Example 34)
Affinity DataIC50:  548nM
Ligand InfoPC cidPC sid
In DepthDetails PubMed