BDBM530749 WO2022076496, Example 46
SMILES CC1(C)C(=O)N(c2ccc(cc12)C(=O)N[C@]1(C)CCCN(CC(F)F)C1)c1cccc(OC(F)F)c1
InChI Key InChIKey=RUEXRMWPVAEHQH-AREMUKBSSA-N
Data  1 IC50
  Tab Delimited (TSV)   2D SDfile   Computed 3D by Vconf -m prep SDfile
Find this compound or compounds like it in BindingDB:
Activity Spreadsheet -- Enzyme Inhibition Constant Data from BindingDB
Found 1 hit for monomerid = 530749
TargetDiacylglycerol O-acyltransferase 2(Homo sapiens (Human))
Merck Sharp &Amp
WIPO
LigandPNGBDBM530749(WO2022076496, Example 46)
Affinity DataIC50:  24nM
Ligand InfoPC cidPC sid
In DepthDetails PubMed