BDBM530767 WO2022076496, Example 64
SMILES CC1(C)C(=O)N(c2ccc(cc12)C(=O)NC1(C)CCS(=O)(=O)CC1)c1cc(OCC(F)(F)F)ccn1
InChI Key InChIKey=PFFHGHOPAOJTIS-UHFFFAOYSA-N
Data  1 IC50
  Tab Delimited (TSV)   2D SDfile   Computed 3D by Vconf -m prep SDfile
Find this compound or compounds like it in BindingDB:
Activity Spreadsheet -- Enzyme Inhibition Constant Data from BindingDB
Found 1 hit for monomerid = 530767
TargetDiacylglycerol O-acyltransferase 2(Homo sapiens (Human))
Merck Sharp &Amp
WIPO
LigandPNGBDBM530767(WO2022076496, Example 64)
Affinity DataIC50:  72nM
Ligand InfoPC cidPC sid
In DepthDetails PubMed