BDBM530775 WO2022076496, Example 72
SMILES CC1(C)C(=O)N(c2ccc(cc12)C(=O)NC1(C)CCS(=O)(=O)CC1)c1nccc(OCC(F)F)c1F
InChI Key InChIKey=ZPRCOMUMUOKFDD-UHFFFAOYSA-N
Data  1 IC50
  Tab Delimited (TSV)   2D SDfile   Computed 3D by Vconf -m prep SDfile
Find this compound or compounds like it in BindingDB:
Activity Spreadsheet -- Enzyme Inhibition Constant Data from BindingDB
Found 1 hit for monomerid = 530775
TargetDiacylglycerol O-acyltransferase 2(Homo sapiens (Human))
Merck Sharp &Amp
WIPO
LigandPNGBDBM530775(WO2022076496, Example 72)
Affinity DataIC50:  821nM
Ligand InfoPC cidPC sid
In DepthDetails PubMed