BDBM530818 WO2022076496, Example 115
SMILES Cc1ncc(OCC(F)F)cc1N1C(=O)C(C)(C)c2cc(ccc12)C(=O)NC1(C)CS(=O)(=O)C1
InChI Key InChIKey=IHHJHSIMXNXCGX-UHFFFAOYSA-N
Data  1 IC50
  Tab Delimited (TSV)   2D SDfile   Computed 3D by Vconf -m prep SDfile
Find this compound or compounds like it in BindingDB:
Activity Spreadsheet -- Enzyme Inhibition Constant Data from BindingDB
Found 1 hit for monomerid = 530818
TargetDiacylglycerol O-acyltransferase 2(Homo sapiens (Human))
Merck Sharp &Amp
WIPO
LigandPNGBDBM530818(WO2022076496, Example 115)
Affinity DataIC50:  213nM
Ligand InfoPC cidPC sid
In DepthDetails PubMed