BDBM530819 WO2022076496, Example 116
SMILES CC1(C)C(=O)N(c2ccc(cc12)C(=O)NC1(C)CCS(=O)(=O)CC1)c1cncc(OC(F)F)n1
InChI Key InChIKey=XYZGFOOWZCHIQN-UHFFFAOYSA-N
Data  1 IC50
  Tab Delimited (TSV)   2D SDfile   Computed 3D by Vconf -m prep SDfile
Find this compound or compounds like it in BindingDB:
Activity Spreadsheet -- Enzyme Inhibition Constant Data from BindingDB
Found 1 hit for monomerid = 530819
TargetDiacylglycerol O-acyltransferase 2(Homo sapiens (Human))
Merck Sharp &Amp
WIPO
LigandPNGBDBM530819(WO2022076496, Example 116)
Affinity DataIC50:  34nM
Ligand InfoPC cidPC sid
In DepthDetails PubMed