BDBM530823 WO2022076496, Example 120
SMILES C[C@]1(CCS(=O)(=O)C1)NC(=O)c1cc2c(N(C(=O)C2(C)C)c2cccc(OC(F)F)c2)c(F)c1
InChI Key InChIKey=LWWBAMBRXKROOO-HSZRJFAPSA-N
Data  1 IC50
  Tab Delimited (TSV)   2D SDfile   Computed 3D by Vconf -m prep SDfile
Find this compound or compounds like it in BindingDB:
Activity Spreadsheet -- Enzyme Inhibition Constant Data from BindingDB
Found 1 hit for monomerid = 530823
TargetDiacylglycerol O-acyltransferase 2(Homo sapiens (Human))
Merck Sharp &Amp
WIPO
LigandPNGBDBM530823(WO2022076496, Example 120)
Affinity DataIC50:  53nM
Ligand InfoPC cidPC sid
In DepthDetails PubMed