BDBM530827 WO2022076496, Example 124
SMILES CC1(CCS(=O)(=O)CC1)NC(=O)c1ccc2N(C(=O)C3(CCCC3)c2c1)c1cccc(OC(F)F)c1
InChI Key InChIKey=QXIHFZUMDQHYNM-UHFFFAOYSA-N
Data  1 IC50
  Tab Delimited (TSV)   2D SDfile   Computed 3D by Vconf -m prep SDfile
Find this compound or compounds like it in BindingDB:
Activity Spreadsheet -- Enzyme Inhibition Constant Data from BindingDB
Found 1 hit for monomerid = 530827
TargetDiacylglycerol O-acyltransferase 2(Homo sapiens (Human))
Merck Sharp &Amp
WIPO
LigandPNGBDBM530827(WO2022076496, Example 124)
Affinity DataIC50:  31nM
Ligand InfoPC cidPC sid
In DepthDetails PubMed