BDBM530833 WO2022076496, Example 129b
SMILES C[C@@H]1CS(=O)(=O)C[C@H]1NC(=O)c1ccc2N(C(=O)C(C)(C)c2c1)c1cccc(OC(F)F)c1
InChI Key InChIKey=MEZWYPWLIOJOGI-FZKQIMNGSA-N
Data  1 IC50
  Tab Delimited (TSV)   2D SDfile   Computed 3D by Vconf -m prep SDfile
Find this compound or compounds like it in BindingDB:
Activity Spreadsheet -- Enzyme Inhibition Constant Data from BindingDB
Found 1 hit for monomerid = 530833
TargetDiacylglycerol O-acyltransferase 2(Homo sapiens (Human))
Merck Sharp &Amp
WIPO
LigandPNGBDBM530833(WO2022076496, Example 129b)
Affinity DataIC50:  85nM
Ligand InfoPC cidPC sid
In DepthDetails PubMed