BDBM530864 WO2022076496, Example 155
SMILES CC1(CS(=O)(=O)C1)NC(=O)c1cnc2N(C(=O)C(C)(C)c2c1)c1cccc(OC(F)F)c1
InChI Key InChIKey=TZBVNHJFZNTBIB-UHFFFAOYSA-N
Data  1 IC50
  Tab Delimited (TSV)   2D SDfile   Computed 3D by Vconf -m prep SDfile
Find this compound or compounds like it in BindingDB:
Activity Spreadsheet -- Enzyme Inhibition Constant Data from BindingDB
Found 1 hit for monomerid = 530864
TargetDiacylglycerol O-acyltransferase 2(Homo sapiens (Human))
Merck Sharp &Amp
WIPO
LigandPNGBDBM530864(WO2022076496, Example 155)
Affinity DataIC50:  888nM
Ligand InfoPC cidPC sid
In DepthDetails PubMed