BDBM533504 jm2c00120, Compound 5
SMILES COc1ccc(c(c1)[N+]([O-])=O)S(=O)(=O)NC[C@H]1O[C@H]([C@H](O)[C@@H]1O)n1cnc2c(N)ncnc12
InChI Key InChIKey=IXFBJTFTIOESKB-IWCJZZDYSA-N
Data  2 IC50
  Tab Delimited (TSV)   2D SDfile   Computed 3D by Vconf -m prep SDfile
Find this compound or compounds like it in BindingDB:
Activity Spreadsheet -- Enzyme Inhibition Constant Data from BindingDB
Found 2 hits for monomerid = 533504
TargetReplicase polyprotein 1ab(Human SARS coronavirus (SARS-CoV) (Severe acute re...)
University Of Montpellier
LigandPNGBDBM533504(jm2c00120, Compound 5)
Affinity DataIC50:  2.60E+3nM. Assay description: The transfer of tritiated methyl from [3H] SAM onto RNA substrate was monitored by filter-binding assay, performed according to the method described ...
Ligand InfoPC cidPC sid
In DepthDetails ArticlePubMed
TargetReplicase polyprotein 1ab(2019-nCoV)
University Of Montpellier
LigandPNGBDBM533504(jm2c00120, Compound 5)
Affinity DataIC50:  1.44E+3nM. Assay description: The transfer of tritiated methyl from [3H] SAM onto RNA substrate was monitored by filter-binding assay, performed according to the method described ...
Ligand InfoPC cidPC sid
In DepthDetails ArticlePubMed