BDBM533536 jm2c00120, Compound 33
SMILES CCOC(=O)CCCCN(C[C@H]1O[C@H]([C@H](O)[C@@H]1O)n1cnc2c(N)ncnc12)S(=O)(=O)c1ccc(OC)c(c1)[N+]([O-])=O
InChI Key InChIKey=FLWQBUCOMCDYNO-FGSUIDRYSA-N
Data  1 IC50
  Tab Delimited (TSV)   2D SDfile   Computed 3D by Vconf -m prep SDfile
Find this compound or compounds like it in BindingDB:
Activity Spreadsheet -- Enzyme Inhibition Constant Data from BindingDB
Found 1 hit for monomerid = 533536
TargetReplicase polyprotein 1ab(2019-nCoV)
University Of Montpellier
LigandPNGBDBM533536(jm2c00120, Compound 33)
Affinity DataIC50:  114nM. Assay description: The transfer of tritiated methyl from [3H] SAM onto RNA substrate was monitored by filter-binding assay, performed according to the method described ...
Ligand InfoPC cidPC sid
In DepthDetails ArticlePubMed