BDBM533537 jm2c00120, Compound 34
SMILES COc1ccc(cc1[N+]([O-])=O)S(=O)(=O)N(CCCCOC(C)=O)C[C@H]1O[C@H]([C@H](O)[C@@H]1O)n1cnc2c(N)ncnc12
InChI Key InChIKey=LYZXQPAYSGPTRV-ZDXOVATRSA-N
Data  1 IC50
  Tab Delimited (TSV)   2D SDfile   Computed 3D by Vconf -m prep SDfile
Find this compound or compounds like it in BindingDB:
Activity Spreadsheet -- Enzyme Inhibition Constant Data from BindingDB
Found 1 hit for monomerid = 533537
TargetReplicase polyprotein 1ab(2019-nCoV)
University Of Montpellier
LigandPNGBDBM533537(jm2c00120, Compound 34)
Affinity DataIC50:  80nM. Assay description: The transfer of tritiated methyl from [3H] SAM onto RNA substrate was monitored by filter-binding assay, performed according to the method described ...
Ligand InfoPC cidPC sid
In DepthDetails ArticlePubMed