BDBM533783 WO2022079616, Example 1.14::rac-1-((Ethoxycarbonyl)oxy)ethyl 5-(3-(4-carbamoylphenyl)-N-methylpyrazolo[1,5- a]pyridine-5-carboxamido)-2-chlorobenzoate
SMILES CCOC(=O)OC(C)OC(=O)c1cc(ccc1Cl)N(C)C(=O)c1ccn2ncc(-c3ccc(cc3)C(N)=O)c2c1
InChI Key InChIKey=PIAYFJDPBZNUKT-UHFFFAOYSA-N
Data  2 IC50
  Tab Delimited (TSV)   2D SDfile   Computed 3D by Vconf -m prep SDfile
Find this compound or compounds like it in BindingDB:
Activity Spreadsheet -- Enzyme Inhibition Constant Data from BindingDB
Found 2 hits for monomerid = 533783
LigandPNGBDBM533783(WO2022079616, Example 1.14 | rac-1-((Ethoxycarbony...)
Affinity DataIC50: >1.00E+3nM
Ligand InfoPC cidPC sid
In DepthDetails PubMed
TargetPhosphatidylinositol 4-kinase()
Novartis
WIPO
LigandPNGBDBM533783(WO2022079616, Example 1.14 | rac-1-((Ethoxycarbony...)
Affinity DataIC50:  550nM. Assay description:  Baculovirus expression and purification of C. parvum phosphatidylinositol 4-kinase: The full-length coding sequence of C. parvum PI(4)K (cgd8_4500, ...
Ligand InfoPC cidPC sid
In DepthDetails PubMed