BDBM533878 6-(Azetidin-1-yl)-N-[2-(dimethylamino)benzene-1-sulfonyl]-4-fluoro-1 -benzofuran-2-carboxamide::WO2022081807, Example 11
SMILES CN(C)c1ccccc1S(=O)(=O)NC(=O)c1cc2c(F)cc(cc2o1)N1CCC1
InChI Key InChIKey=OTKKHXUEDQFZQV-UHFFFAOYSA-N
Data  1 IC50
  Tab Delimited (TSV)   2D SDfile   Computed 3D by Vconf -m prep SDfile
Find this compound or compounds like it in BindingDB:
Activity Spreadsheet -- Enzyme Inhibition Constant Data from BindingDB
Found 1 hit for monomerid = 533878
TargetHistone acetyltransferase KAT6A [507-778](Homo sapiens)
The Broad Institute
WIPO
LigandPNGBDBM533878(6-(Azetidin-1-yl)-N-[2-(dimethylamino)benzene-1-su...)
Affinity DataIC50:  7.52nM. Assay description: Kat6a inhibitory activities of the compounds described in the present invention were quantified using a Fluorescence Resonance Energy Transfer (TR-FR...
Ligand InfoPC cidPC sid
In DepthDetails PubMed