BDBM533973 WO2022081807, Example 80
SMILES CC1(C)CCc2cccc(c2O1)S(=O)(=O)NC(=O)c1cc2c(F)cc(cc2o1)N1CCC1
InChI Key InChIKey=SOOOOLDBSICAIZ-UHFFFAOYSA-N
Data  1 IC50
  Tab Delimited (TSV)   2D SDfile   Computed 3D by Vconf -m prep SDfile
Find this compound or compounds like it in BindingDB:
Activity Spreadsheet -- Enzyme Inhibition Constant Data from BindingDB
Found 1 hit for monomerid = 533973
TargetHistone acetyltransferase KAT6A [507-778](Homo sapiens)
The Broad Institute
WIPO
LigandPNGBDBM533973(WO2022081807, Example 80)
Affinity DataIC50:  12nM. Assay description: Kat6a inhibitory activities of the compounds described in the present invention were quantified using a Fluorescence Resonance Energy Transfer (TR-FR...
Ligand InfoPC cidPC sid
In DepthDetails PubMed