BDBM534100 WO2022081807, Example 207
SMILES CCOc1ccc(cc1S(=O)(=O)NC(=O)c1cc2c(F)cc(cc2o1)N1CCC1)C(C)CC
InChI Key InChIKey=GKMXHFVUQSZEAQ-UHFFFAOYSA-N
Data  2 IC50
  Tab Delimited (TSV)   2D SDfile   Computed 3D by Vconf -m prep SDfile
Find this compound or compounds like it in BindingDB:
Activity Spreadsheet -- Enzyme Inhibition Constant Data from BindingDB
Found 2 hits for monomerid = 534100
TargetHistone acetyltransferase KAT6B(Homo sapiens)
The Broad Institute
WIPO
LigandPNGBDBM534100(WO2022081807, Example 207)
Affinity DataIC50:  5.65nM. Assay description: Kat6b inhibitory activities of the compounds described in the present invention were quantified using a Fluorescence Resonance Energy Transfer (TR-FR...
Ligand InfoPC cidPC sid
In DepthDetails PubMed
TargetHistone acetyltransferase KAT6A [507-778](Homo sapiens)
The Broad Institute
WIPO
LigandPNGBDBM534100(WO2022081807, Example 207)
Affinity DataIC50:  1.86nM. Assay description: Kat6a inhibitory activities of the compounds described in the present invention were quantified using a Fluorescence Resonance Energy Transfer (TR-FR...
Ligand InfoPC cidPC sid
In DepthDetails PubMed