BDBM534127 N-([1,1'-biphenyl]-2-sulfonyl)-6-cyano-1-benzofuran-2-carboxamide ::WO2022081842, Example 3
SMILES O=C(NS(=O)(=O)c1ccccc1-c1ccccc1)c1cc2ccc(cc2o1)-c1ccc(cc1)C#N
InChI Key InChIKey=ILFMYHZOWPKADA-UHFFFAOYSA-N
Data  1 IC50
  Tab Delimited (TSV)   2D SDfile   Computed 3D by Vconf -m prep SDfile
Find this compound or compounds like it in BindingDB:
Activity Spreadsheet -- Enzyme Inhibition Constant Data from BindingDB
Found 1 hit for monomerid = 534127
TargetHistone acetyltransferase KAT6A [507-778](Homo sapiens)
The Broad Institute
WIPO
LigandPNGBDBM534127(N-([1,1'-biphenyl]-2-sulfonyl)-6-cyano-1-benzofura...)
Affinity DataIC50: >2.00E+4nM. Assay description:  Kat6a inhibitory activities of the compounds described in the present invention were quantified using a Fluorescence Resonance Energy Transfer (TR-F...
Ligand InfoPC cidPC sid
In DepthDetails PubMed