BDBM534134 N-([1,1'-biphenyl]-2-sulfonyl)-4-methoxy-6-methyl-1-benzofuran-2-carboxamide ::WO2022081842, Example 10
SMILES COc1cc(C)cc2oc(cc12)C(=O)NS(=O)(=O)c1ccccc1-c1ccccc1
InChI Key InChIKey=YYZMSKFFWLYMCV-UHFFFAOYSA-N
Data  2 IC50
  Tab Delimited (TSV)   2D SDfile   Computed 3D by Vconf -m prep SDfile
Find this compound or compounds like it in BindingDB:
Activity Spreadsheet -- Enzyme Inhibition Constant Data from BindingDB
Found 2 hits for monomerid = 534134
TargetHistone acetyltransferase KAT6B(Homo sapiens)
The Broad Institute
WIPO
LigandPNGBDBM534134(N-([1,1'-biphenyl]-2-sulfonyl)-4-methoxy-6-methyl-...)
Affinity DataIC50:  1.12E+3nM. Assay description:  Kat6b inhibitory activities of the compounds described in the present invention were quantified using a Fluorescence Resonance Energy Transfer (TR-F...
Ligand InfoPC cidPC sid
In DepthDetails PubMed
TargetHistone acetyltransferase KAT6A [507-778](Homo sapiens)
The Broad Institute
WIPO
LigandPNGBDBM534134(N-([1,1'-biphenyl]-2-sulfonyl)-4-methoxy-6-methyl-...)
Affinity DataIC50:  933nM. Assay description:  Kat6a inhibitory activities of the compounds described in the present invention were quantified using a Fluorescence Resonance Energy Transfer (TR-F...
Ligand InfoPC cidPC sid
In DepthDetails PubMed