BDBM534135 N-(3'-chloro[1,1'-biphenyl]-2-sulfonyl)-4,6-dimethyl-1-benzofuran-2-carboxamide ::WO2022081842, Example 11
SMILES Cc1cc(C)c2cc(oc2c1)C(=O)NS(=O)(=O)c1ccccc1-c1cccc(Cl)c1
InChI Key InChIKey=RPNBGMRKQRNGOA-UHFFFAOYSA-N
Data  2 IC50
  Tab Delimited (TSV)   2D SDfile   Computed 3D by Vconf -m prep SDfile
Find this compound or compounds like it in BindingDB:
Activity Spreadsheet -- Enzyme Inhibition Constant Data from BindingDB
Found 2 hits for monomerid = 534135
TargetHistone acetyltransferase KAT6B(Homo sapiens)
The Broad Institute
WIPO
LigandPNGBDBM534135(N-(3'-chloro[1,1'-biphenyl]-2-sulfonyl)-4,6-dimeth...)
Affinity DataIC50:  299nM. Assay description:  Kat6b inhibitory activities of the compounds described in the present invention were quantified using a Fluorescence Resonance Energy Transfer (TR-F...
Ligand InfoPC cidPC sid
In DepthDetails PubMed
TargetHistone acetyltransferase KAT6A [507-778](Homo sapiens)
The Broad Institute
WIPO
LigandPNGBDBM534135(N-(3'-chloro[1,1'-biphenyl]-2-sulfonyl)-4,6-dimeth...)
Affinity DataIC50:  64nM. Assay description:  Kat6a inhibitory activities of the compounds described in the present invention were quantified using a Fluorescence Resonance Energy Transfer (TR-F...
Ligand InfoPC cidPC sid
In DepthDetails PubMed