BDBM534140 N-([1,1'-biphenyl]-2-sulfonyl)-6-cyclopropyl-1-benzofuran-2-carboxamide ::WO2022081842, Example 16
SMILES O=C(NS(=O)(=O)c1ccccc1-c1ccccc1)c1cc2ccc(cc2o1)C1CC1
InChI Key InChIKey=FZKNVOUHIRQWIZ-UHFFFAOYSA-N
Data  2 IC50
  Tab Delimited (TSV)   2D SDfile   Computed 3D by Vconf -m prep SDfile
Find this compound or compounds like it in BindingDB:
Activity Spreadsheet -- Enzyme Inhibition Constant Data from BindingDB
Found 2 hits for monomerid = 534140
TargetHistone acetyltransferase KAT6B(Homo sapiens)
The Broad Institute
WIPO
LigandPNGBDBM534140(N-([1,1'-biphenyl]-2-sulfonyl)-6-cyclopropyl-1-ben...)
Affinity DataIC50:  104nM. Assay description:  Kat6b inhibitory activities of the compounds described in the present invention were quantified using a Fluorescence Resonance Energy Transfer (TR-F...
Ligand InfoPC cidPC sid
In DepthDetails PubMed
TargetHistone acetyltransferase KAT6A [507-778](Homo sapiens)
The Broad Institute
WIPO
LigandPNGBDBM534140(N-([1,1'-biphenyl]-2-sulfonyl)-6-cyclopropyl-1-ben...)
Affinity DataIC50:  62nM. Assay description:  Kat6a inhibitory activities of the compounds described in the present invention were quantified using a Fluorescence Resonance Energy Transfer (TR-F...
Ligand InfoPC cidPC sid
In DepthDetails PubMed