BDBM534151 N-([1,1'-biphenyl]-2-sulfonyl)-6-(2-methoxyethyl)-1-benzofuran-2-carboxamide ::WO2022081842, Example 26
SMILES COCCc1ccc2cc(oc2c1)C(=O)NS(=O)(=O)c1ccccc1-c1ccccc1
InChI Key InChIKey=LAEJJUWNIFQBRC-UHFFFAOYSA-N
Data  2 IC50
  Tab Delimited (TSV)   2D SDfile   Computed 3D by Vconf -m prep SDfile
Find this compound or compounds like it in BindingDB:
Activity Spreadsheet -- Enzyme Inhibition Constant Data from BindingDB
Found 2 hits for monomerid = 534151
TargetHistone acetyltransferase KAT6B(Homo sapiens)
The Broad Institute
WIPO
LigandPNGBDBM534151(N-([1,1'-biphenyl]-2-sulfonyl)-6-(2-methoxyethyl)-...)
Affinity DataIC50:  2.85E+3nM. Assay description:  Kat6b inhibitory activities of the compounds described in the present invention were quantified using a Fluorescence Resonance Energy Transfer (TR-F...
Ligand InfoPC cidPC sid
In DepthDetails PubMed
TargetHistone acetyltransferase KAT6A [507-778](Homo sapiens)
The Broad Institute
WIPO
LigandPNGBDBM534151(N-([1,1'-biphenyl]-2-sulfonyl)-6-(2-methoxyethyl)-...)
Affinity DataIC50:  1.13E+3nM. Assay description:  Kat6a inhibitory activities of the compounds described in the present invention were quantified using a Fluorescence Resonance Energy Transfer (TR-F...
Ligand InfoPC cidPC sid
In DepthDetails PubMed