BDBM534157 6-Cyclopropyl-N-(2-ethoxy-5-fluoro-phenyl)sulfonyl-4-fluoro-benzofuran-2-carboxamide::WO2022081842, Example 32
SMILES CCOc1ccc(F)cc1S(=O)(=O)NC(=O)c1cc2c(F)cc(cc2o1)C1CC1
InChI Key InChIKey=GSTBNZGWNGVUEW-UHFFFAOYSA-N
Data  1 IC50
  Tab Delimited (TSV)   2D SDfile   Computed 3D by Vconf -m prep SDfile
Find this compound or compounds like it in BindingDB:
Activity Spreadsheet -- Enzyme Inhibition Constant Data from BindingDB
Found 1 hit for monomerid = 534157
TargetHistone acetyltransferase KAT6A [507-778](Homo sapiens)
The Broad Institute
WIPO
LigandPNGBDBM534157(6-Cyclopropyl-N-(2-ethoxy-5-fluoro-phenyl)sulfonyl...)
Affinity DataIC50:  56nM. Assay description:  Kat6a inhibitory activities of the compounds described in the present invention were quantified using a Fluorescence Resonance Energy Transfer (TR-F...
Ligand InfoPC cidPC sid
In DepthDetails PubMed