BDBM534179 N-(Benzenesulfonyl)-6-cyclopropyl-4-(trifluoromethyl)benzofuran-2-carboxamide::WO2022081842, Example 52
SMILES FC(F)(F)c1cc(cc2oc(cc12)C(=O)NS(=O)(=O)c1ccccc1)C1CC1
InChI Key InChIKey=GZOCXTSSIPIBRX-UHFFFAOYSA-N
Data  1 IC50
  Tab Delimited (TSV)   2D SDfile   Computed 3D by Vconf -m prep SDfile
Find this compound or compounds like it in BindingDB:
Activity Spreadsheet -- Enzyme Inhibition Constant Data from BindingDB
Found 1 hit for monomerid = 534179
TargetHistone acetyltransferase KAT6A [507-778](Homo sapiens)
The Broad Institute
WIPO
LigandPNGBDBM534179(N-(Benzenesulfonyl)-6-cyclopropyl-4-(trifluorometh...)
Affinity DataIC50:  138nM. Assay description:  Kat6a inhibitory activities of the compounds described in the present invention were quantified using a Fluorescence Resonance Energy Transfer (TR-F...
Ligand InfoPC cidPC sid
In DepthDetails PubMed