BDBM534271 ((2R,3S,4R,5R)-5-(4-aminopyrrolo[2,1-f][1,2,4]triazin-7-yl)-5-cyano-3,4-dihydroxytetrahydrofuran-2-yl)methyl ((R)-2-((3-cyano-5-fluorobenzyl)oxy)nonadec-4-yn-1-yl) hydrogen phosphate (74)::WO2022081973, Example 74
SMILES CCCCCCCCCCCCCCC#C[C@H](COP(O)(=O)OC[C@H]1O[C@](C#N)([C@H](O)[C@@H]1O)c1ccc2c(N)ncnn12)OCc1cc(F)cc(c1)C#N
InChI Key InChIKey=AHQXIIHEZYORNY-OFLAYAGSSA-N
Data  2 EC50
  Tab Delimited (TSV)   2D SDfile   Computed 3D by Vconf -m prep SDfile
Find this compound or compounds like it in BindingDB:
Activity Spreadsheet -- Enzyme Inhibition Constant Data from BindingDB
Found 2 hits for monomerid = 534271
TargetFusion glycoprotein F0(Human respiratory syncytial virus A (strain A2))
Gilead Sciences
WIPO
LigandPNGBDBM534271(((2R,3S,4R,5R)-5-(4-aminopyrrolo[2,1-f][1,2,4]tria...)
Affinity DataEC50:  24nM. Assay description: Antiviral activity of compounds against SARS-CoV-2 is evaluated as described in Xue, Xi et al.2020. Briefly, the human alveolar epithelial cell line ...
Ligand InfoPC cidPC sid
In DepthDetails PubMed
TargetReplicase polyprotein 1ab(2019-nCoV)
Gilead Sciences
WIPO
LigandPNGBDBM534271(((2R,3S,4R,5R)-5-(4-aminopyrrolo[2,1-f][1,2,4]tria...)
Affinity DataEC50:  190nM. Assay description: Antiviral activity of compounds against SARS-CoV-2 is evaluated as described in Xue, Xi et al.2020. Briefly, the human alveolar epithelial cell line ...
Ligand InfoPC cidPC sid
In DepthDetails PubMed