BDBM534399 WO2022086828, Example 135
SMILES COc1c(ccn2nc(N)nc12)-c1ccc(C)c(C(=O)NCC(F)(F)[C@@H](O)c2ccc(F)cc2)c1F
InChI Key InChIKey=XYVQOYARHKRTFN-FQEVSTJZSA-N
Data  3 IC50
  Tab Delimited (TSV)   2D SDfile   Computed 3D by Vconf -m prep SDfile
Find this compound or compounds like it in BindingDB:
Activity Spreadsheet -- Enzyme Inhibition Constant Data from BindingDB
Found 3 hits for monomerid = 534399
TargetMixed lineage kinase domain-like protein(Homo sapiens)
Bristol-Myers Squibb
WIPO
LigandPNGBDBM534399(WO2022086828, Example 135)
Affinity DataIC50:  5.60nM. Assay description: HT29-L23 human colorectal adenocarcinoma cells were maintained in RPMI 1640 medium containing 10% heat-inactivated FBS, 1% Penicillin-Streptomycin an...
Ligand InfoPC cidPC sid
In DepthDetails PubMed
TargetPhosphatidylinositol 4,5-bisphosphate 3-kinase catalytic subunit delta isoform(Homo sapiens (Human))
Bristol-Myers Squibb
WIPO
LigandPNGBDBM534399(WO2022086828, Example 135)
Affinity DataIC50: >1.50E+4nM. Assay description: A solution was prepared containing 0.2 nM Anti GST-Tb (Cisbio, 61GSTTLB), 40 nM probe and 1 nM GST-tagged PIK3C5 in complex with PIK3R1 (Invitrogen #...
Ligand InfoPC cidPC sid
In DepthDetails PubMed
TargetReceptor-interacting serine/threonine-protein kinase 1(Homo sapiens (Human))
Bristol-Myers Squibb
WIPO
LigandPNGBDBM534399(WO2022086828, Example 135)
Affinity DataIC50:  0.5nM. Assay description: A solution was prepared containing 0.2 nM Anti GST-Tb (Cisbio, 61GSTTLB), 90.6 nM probe and 1 nM His-GST-TVMV-hRIPKl (1-324) in FRET Buffer (20 mM HE...
Ligand InfoPC cidPC sid
In DepthDetails PubMed