BDBM53463 1-[[4-(1-adamantyl)phenyl]methylideneamino]thiourea::4-(1-adamantyl)benzaldehyde thiosemicarbazone::MLS001000567::O-acyl oxime isatin derivative, 45::SMR000496110::[[4-(1-adamantyl)benzylidene]amino]thiourea::[[4-(1-adamantyl)phenyl]methylideneamino]thiourea::cid_2839927
SMILES [H]C12CC3([H])CC([H])(C1)CC(C2)(C3)c1ccc(C=NNC(N)=S)cc1
InChI Key InChIKey=WNIHCDKRHQZZIR-UHFFFAOYSA-N
Data  2 IC50  1 EC50
  Tab Delimited (TSV)   2D SDfile   Computed 3D by Vconf -m prep SDfile
Find this compound or compounds like it in BindingDB:
Activity Spreadsheet -- Enzyme Inhibition Constant Data from BindingDB
Found 3 hits for monomerid = 53463
TargetUbiquitin carboxyl-terminal hydrolase isozyme L1(Mus musculus (Mouse))
Brigham And Women'S Hospital
LigandPNGBDBM53463(1-[[4-(1-adamantyl)phenyl]methylideneamino]thioure...)
Affinity DataIC50:  5.20E+4nMpH: 7.6 T: 2°C. Assay description: Inhibition activity and selectivity for UCH-L1 and UCH-L3.
In DepthDetails ArticlePubMed
TargetStreptokinase A(Streptococcus pyogenes M1 GAS)
Broad Institute
Curated by PubChem BioAssay
LigandPNGBDBM53463(1-[[4-(1-adamantyl)phenyl]methylideneamino]thioure...)
Affinity DataEC50:  1.34E+4nM. Assay description: Keywords: Group A streptococcus, GAS, streptokinase, expression, virulence, inhibition, dose response, EC50 Assay Overview: The goal of this assa...
In DepthDetails PCBioAssay
TargetGenome polyprotein(Hepatitis C virus)
The Scripps Research Institute Molecular Screening Center
Curated by PubChem BioAssay
LigandPNGBDBM53463(1-[[4-(1-adamantyl)phenyl]methylideneamino]thioure...)
Affinity DataIC50:  5.41E+3nM. Assay description: Source (MLPCN Center Name): The Scripps Research Institute Molecular Screening Center (SRIMSC) Center Affiliation: The Scripps Research Institute (TS...
In DepthDetails PCBioAssay